Target
Indoleamine 2,3-dioxygenase 1
Ligand
BDBM312089
Substrate
Meas. Tech.
Enzymatic Activity Assay
IC50
4600±n/a nM
Citation
 Crosignani, SCauwenberghs, SDriessens, GDeroose, F Pyrrolidine-2, 5-dione derivatives, pharmaceutical compositions and methods for use as IDO1 inhibitors US Patent  US9949951 Publication Date 4/24/2018 
Target
Name:
Indoleamine 2,3-dioxygenase 1
Synonyms:
I23O1_HUMAN IDO-1 INDO Indoleamine 2,3-dioxygenase | Indoleamine-pyrrole 2,3-dioxygenase
Type:
Enzyme
Mol. Mass.:
45330.80
Organism:
Homo sapiens (Human)
Description:
P14902
Residue:
403
  
Inhibitor
Name:
BDBM312089
Synonyms:
3-(7-fluoronaphthanlen- 1-yl)pyrrolidine-2,5- dione US9949951, 25
Type:
Small organic molecule
Emp. Form.:
C14H10FNO2
Mol. Mass.:
243.2331
SMILES:
Fc1ccc2cccc(C3CC(=O)NC3=O)c2c1
: