Target
Oxysterols receptor LXR-beta
Ligand
BDBM19992
Substrate
biotinylated SRC-1 peptide
Meas. Tech.
HTRF Cofactor Peptide Recruitment Assay
EC50
35±n/a nM
Citation
 Kher, SLake, KSircar, IPannala, MBakir, FZapf, JXu, KZhang, SHLiu, JMorera, LSakurai, NJack, RCheng, JF 2-Aryl-N-acyl indole derivatives as liver X receptor (LXR) agonists. Bioorg Med Chem Lett 17:4442-6 (2007)  
Target
Name:
Oxysterols receptor LXR-beta
Synonyms:
LXRB Liver X, LXR beta NR1H2 Nuclear receptor NER Ubiquitously-expressed nuclear receptor
Type:
Enzyme Catalytic Domain
Mol. Mass.:
50978.79
Organism:
Homo sapiens (Human)
Description:
P55055
Residue:
460
  
Inhibitor
Name:
BDBM19992
Synonyms:
2-[3-[3-[[2-chloro-3-(trifluoromethyl)phenyl]methyl-[2,2-di(phenyl)ethyl]amino]propoxy]phenyl]acetic acid CHEMBL59030 GW3965 US10669296, Compound GW3965 | US10945978, Compound 2
Type:
Small organic molecule
Emp. Form.:
C33H31ClF3NO3
Mol. Mass.:
582.052
SMILES:
OC(=O)Cc1cccc(OCCCN(CC(c2ccccc2)c2ccccc2)Cc2cccc(c2Cl)C(F)(F)F)c1
:
Substrate
Name:
biotinylated SRC-1 peptide
Synonyms:
Type:
Peptide
Mol. Mass.:
3157.52
Organism:
Description:
A biotinylated peptide comprises amino acids 675-699 of steroid receptor coactivator 1 (SRC1).
Residue:
28