Target
Dual specificity tyrosine-phosphorylation-regulated kinase 1A
Ligand
BDBM293441
Substrate
Meas. Tech.
Kinase Assay
EC50
33.3±n/a nM
Citation
 KC, SKMak, CCEastman, BWCao, JBollu, VMittapalli, GKChiruta, C Isoquinolin-3-yl carboxamides and preparation and use thereof US Patent  US9951048 Publication Date 4/24/2018 
Target
Name:
Dual specificity tyrosine-phosphorylation-regulated kinase 1A
Synonyms:
DYR1A_HUMAN DYRK1A Dual specificity YAK1-related kinase 1A (Dyrk1A) Dual-specificity tyrosine-phosphorylation regulated kinase 1A HP86 MNBH
Type:
Enzyme
Mol. Mass.:
85616.61
Organism:
Homo sapiens (Human)
Description:
Q13627
Residue:
763
  
Inhibitor
Name:
BDBM293441
Synonyms:
US10106527, Compound 27 US11548872, Compound 27 US9951048, Compound 27
Type:
Small organic molecule
Emp. Form.:
C26H27N7O2
Mol. Mass.:
469.5383
SMILES:
CNC(=O)c1ccc(cn1)C(=O)Nc1cc2cc(ccc2cn1)-c1cnn(c1)C1CCN(C)CC1
: