Target
Cell division cycle 7-related protein kinase [58-574]/Protein DBF4 homolog A
Ligand
BDBM27401
Substrate
MCM2
Meas. Tech.
In Vitro Kinase Assay
pH
7.9±n/a
Temperature
298.15±n/a K
IC50
3300±n/a nM
Citation
 Vanotti, EAmici, RBargiotti, ABerthelsen, JBosotti, RCiavolella, ACirla, ACristiani, CD'Alessio, RForte, BIsacchi, AMartina, KMenichincheri, MMolinari, AMontagnoli, AOrsini, PPillan, ARoletto, FScolaro, ATibolla, MValsasina, BVarasi, MVolpi, DSantocanale, C Cdc7 kinase inhibitors: pyrrolopyridinones as potential antitumor agents. 1. Synthesis and structure-activity relationships. J Med Chem 51:487-501 (2008)  
Target
Name:
Cell division cycle 7-related protein kinase [58-574]/Protein DBF4 homolog A
Synonyms:
Cdc7 Kinase | Cdc7/DBF4
Type:
Protein Complex
Mol. Mass.:
Description:
Components:
This complex has 2 components.
Component 1
Name:
Cell division cycle 7-related protein kinase [58-574]
Synonyms:
CDC7 CDC7_HUMAN Cell division cycle 7-related protein kinase
Type:
Serine/threonine-protein kinase
Mol. Mass.:
57470.88
Organism:
Homo sapiens (Human)
Description:
O00311[58-574]
Residue:
517
  
Component 2
Name:
Protein DBF4 homolog A
Synonyms:
ASK Chiffon homolog A DBF4-type zinc finger-containing protein 1 DBF4A_HUMAN ZDBF1
Type:
Regulatory subunit
Mol. Mass.:
76869.65
Organism:
Homo sapiens (Human)
Description:
Residue:
674
  
Inhibitor
Name:
BDBM27401
Synonyms:
1-(2-hydroxyethyl)-2-(pyridin-4-yl)-1H,4H,5H,6H,7H-pyrrolo[3,2-c]pyridin-4-one | pyrrolopyridinone scaffold, 23
Type:
Small organic molecule
Emp. Form.:
C14H15N3O2
Mol. Mass.:
257.2878
SMILES:
OCCn1c2CCNC(=O)c2cc1-c1ccncc1
:
Substrate
Name:
MCM2
Synonyms:
BM28 CDCL1 KIAA0030 MCM2_HUMAN Nuclear protein BM28
Type:
Other Protein Type
Mol. Mass.:
32619.37
Organism:
Homo sapiens (Human)
Description:
P49736[10-294]
Residue:
285