Target
Inhibitor of nuclear factor kappa-B kinase subunit epsilon
Ligand
BDBM27443
Substrate
I-kappa-B-alpha
Meas. Tech.
IKK Kinase Inhibition Assay
pH
7.4±n/a
Temperature
295.15±n/a K
IC50
3981±n/a nM
Citation
 Bamborough, PChristopher, JACutler, GJDickson, MCMellor, GWMorey, JVPatel, CBShewchuk, LM 5-(1H-Benzimidazol-1-yl)-3-alkoxy-2-thiophenecarbonitriles as potent, selective, inhibitors of IKK-epsilon kinase. Bioorg Med Chem Lett 16:6236-40 (2006)  
Target
Name:
Inhibitor of nuclear factor kappa-B kinase subunit epsilon
Synonyms:
I kappa-B kinase epsilon I-kappa-B kinase epsilon (IKK-E) IKBKE IKK-epsilon IKKE IKKI KIAA0151 | von Hippel-Lindau disease tumor suppressor/Inhibitor of nuclear factor kappa-B kinase subunit epsilon
Type:
Serine/threonine-protein kinase
Mol. Mass.:
80475.98
Organism:
Homo sapiens (Human)
Description:
Kinase inhibitory activity was determined using recombinant human IKK-epsilon expressed in baculovirus as a FLAG-tagged fusion protein.
Residue:
716
  
Inhibitor
Name:
BDBM27443
Synonyms:
5-(1H-1,3-benzodiazol-1-yl)-3-[(4-methylphenyl)methoxy]thiophene-2-carboxamide benzimidazole-thiophene carboxamide, 1
Type:
Small organic molecule
Emp. Form.:
C20H17N3O2S
Mol. Mass.:
363.433
SMILES:
Cc1ccc(COc2cc(sc2C(N)=O)-n2cnc3ccccc23)cc1
:
Substrate
Name:
NF-kappa-B inhibitor alpha
Synonyms:
I-kappa-B-alpha IKBA_HUMAN NF-kappa-B inhibitor alpha NFKBIA
Type:
GST fusion protein
Mol. Mass.:
35584.84
Organism:
Homo sapiens (Human)
Description:
It was produced in E. coli as GST-tagged fusion protein (Santa Cruz Biotechnology).
Residue:
317