Target
Poly [ADP-ribose] polymerase 1
Ligand
BDBM27707
Substrate
BDBM27683
Meas. Tech.
PARP Enzyme Inhibition Assay
pH
8±n/a
Temperature
296.15±n/a K
IC50
3.0±0.6 nM
Citation
 Ishida, JYamamoto, HKido, YKamijo, KMurano, KMiyake, HOhkubo, MKinoshita, TWarizaya, MIwashita, AMihara, KMatsuoka, NHattori, K Discovery of potent and selective PARP-1 and PARP-2 inhibitors: SBDD analysis via a combination of X-ray structural study and homology modeling. Bioorg Med Chem 14:1378-90 (2006)  
Target
Name:
Poly [ADP-ribose] polymerase 1
Synonyms:
(ARTD1 or PARP1) 2.4.2.30 ADPRT ARTD1 Human diphtheria toxin-like ADP-ribosyltransferase (ARTD1 or PARP1) NT-PARP-1 PARP1 PPOL Poly [ADP-ribose] polymerase 1 (PARP) Poly [ADP-ribose] polymerase 1 (PARP1) Poly [ADP-ribose] polymerase 1, 28-kDa form Poly [ADP-ribose] polymerase 1, processed C-terminus Poly [ADP-ribose] polymerase-1 Poly(ADP-ribose) polymerase-1 (ARTD1/PARP1) Protein poly-ADP-ribosyltransferase PARP1 | Synonyms=ADPRT
Type:
Mol. Mass.:
113114.22
Organism:
Homo sapiens (Human)
Description:
P09874
Residue:
1014
  
Inhibitor
Name:
BDBM27707
Synonyms:
4-{1-[3-(8-chloro-4-oxo-3,4-dihydroquinazolin-2-yl)propyl]-1,2,3,6-tetrahydropyridin-4-yl}benzonitrile quinazolinone analogue, 1c
Type:
Small organic molecule
Emp. Form.:
C23H21ClN4O
Mol. Mass.:
404.892
SMILES:
Clc1cccc2c1nc(CCCN1CCC(=CC1)c1ccc(cc1)C#N)[nH]c2=O
:
Substrate
Name:
BDBM27683
Synonyms:
[adenylate-32P]-NAD
Type:
radiolabeled substrate
Emp. Form.:
Mol. Mass.:
SMILES:
: