Target
Gag-Pol polyprotein [489-587]
Ligand
BDBM292
Substrate
Meas. Tech.
Protease Inhibition Assay
IC50
57±n/a nM
Citation
 Kim, BMEvans, BEGilbert, KFHanifin, CMVacca, JPMichelson, SRDarke, PLZugay, JA Cycloalkylpiperazines as HIV-1 Protease Inhibitors: Enhanced Oral Absorption Bioorg Med Chem Lett 5:2707-12 (1995)    Article 
Target
Name:
Gag-Pol polyprotein [489-587]
Synonyms:
Human immunodeficiency virus type 1 protease Pol polyprotein | gag-pol
Type:
Enzyme Subunit
Mol. Mass.:
10781.16
Organism:
Human immunodeficiency virus type 1
Description:
P04585[489-587]
Residue:
99
  
Inhibitor
Name:
BDBM292
Synonyms:
(2R,3R)-1,1-dioxo-2-(propan-2-yl)--thiolan-3-yl N-[(2S,3R)-4-[(2S)-2-(tert-butylcarbamoyl)-4-(propan-2-yl)piperazin-1-yl]-3-hydroxy-1-phenylbutan-2-yl]carbamate | 1-(2OHPr)-4-Substit-piperazine, thienyl carbamate deriv. 3
Type:
Small organic molecule
Emp. Form.:
C30H50N4O6S
Mol. Mass.:
594.806
SMILES:
CC(C)[C@@H]1[C@@H](CCS1(=O)=O)OC(=O)N[C@@H](Cc1ccccc1)[C@H](O)CN1CCN(C[C@H]1C(=O)NC(C)(C)C)C(C)C
: