Target
Histone deacetylase 1
Ligand
BDBM27770
Substrate
BDBM25143
Meas. Tech.
HDAC Activity Assay
pH
8±n/a
Temperature
310.15±n/a K
IC50
10±n/a nM
Citation
 Kattar, SDSurdi, LMZabierek, AMethot, JLMiddleton, REHughes, BSzewczak, AADahlberg, WKKral, AMOzerova, NFleming, JCWang, HSecrist, PHarsch, AHamill, JECruz, JCKenific, CMChenard, MMiller, TABerk, SCTempest, P Parallel medicinal chemistry approaches to selective HDAC1/HDAC2 inhibitor (SHI-1:2) optimization. Bioorg Med Chem Lett 19:1168-72 (2009)  
Target
Name:
Histone deacetylase 1
Synonyms:
Cereblon/Histone deacetylase 1 HDAC1 Histone deacetylase 1 (HDAC1) RPD3L1
Type:
Enzyme
Mol. Mass.:
55090.27
Organism:
Homo sapiens (Human)
Description:
Q13547
Residue:
482
  
Inhibitor
Name:
BDBM27770
Synonyms:
N-(2-amino-5-phenylphenyl)-4-{[methyl(pyridin-4-yl)amino]methyl}benzamide biphenyl diamine analogue, 18
Type:
Small organic molecule
Emp. Form.:
C26H24N4O
Mol. Mass.:
408.495
SMILES:
CN(Cc1ccc(cc1)C(=O)Nc1cc(ccc1N)-c1ccccc1)c1ccncc1
:
Substrate
Name:
BDBM25143
Synonyms:
Fluor-de-Lys Fluorogenic Deacetylase Substrate | KI-104 (BioMol Research Laboratories)
Type:
Fluorogenic Substrate
Emp. Form.:
Mol. Mass.:
SMILES:
: