Target
Histone deacetylase 1
Ligand
BDBM27774
Substrate
BDBM25143
Meas. Tech.
HDAC Activity Assay
pH
8±n/a
Temperature
310.15±n/a K
IC50
4±n/a nM
Citation
 Kattar, SDSurdi, LMZabierek, AMethot, JLMiddleton, REHughes, BSzewczak, AADahlberg, WKKral, AMOzerova, NFleming, JCWang, HSecrist, PHarsch, AHamill, JECruz, JCKenific, CMChenard, MMiller, TABerk, SCTempest, P Parallel medicinal chemistry approaches to selective HDAC1/HDAC2 inhibitor (SHI-1:2) optimization. Bioorg Med Chem Lett 19:1168-72 (2009)  
Target
Name:
Histone deacetylase 1
Synonyms:
Cereblon/Histone deacetylase 1 HDAC1 Histone deacetylase 1 (HDAC1) RPD3L1
Type:
Enzyme
Mol. Mass.:
55090.27
Organism:
Homo sapiens (Human)
Description:
Q13547
Residue:
482
  
Inhibitor
Name:
BDBM27774
Synonyms:
N-[2-amino-5-(thiophen-2-yl)phenyl]-4-{1,8-diazaspiro[4.5]decan-8-ylmethyl}benzamide | biphenyl diamine analogue, 22
Type:
Small organic molecule
Emp. Form.:
C26H30N4OS
Mol. Mass.:
446.608
SMILES:
Nc1ccc(cc1NC(=O)c1ccc(CN2CCC3(CCCN3)CC2)cc1)-c1cccs1
:
Substrate
Name:
BDBM25143
Synonyms:
Fluor-de-Lys Fluorogenic Deacetylase Substrate | KI-104 (BioMol Research Laboratories)
Type:
Fluorogenic Substrate
Emp. Form.:
Mol. Mass.:
SMILES:
: