Target
Mitogen-activated protein kinase 8
Ligand
BDBM27817
Substrate
Biotin-GST-c-JUN
Meas. Tech.
JNK1 Inhibition Assay
IC50
5010±n/a nM
Citation
 Chamberlain, SDRedman, AMWilson, JWDeanda, FShotwell, JBGerding, RLei, HYang, BStevens, KLHassell, AMShewchuk, LMLeesnitzer, MASmith, JLSabbatini, PAtkins, CGroy, ARowand, JLKumar, RMook, RAMoorthy, GPatnaik, S Optimization of 4,6-bis-anilino-1H-pyrrolo[2,3-d]pyrimidine IGF-1R tyrosine kinase inhibitors towards JNK selectivity. Bioorg Med Chem Lett 19:360-4 (2009)  
Target
Name:
Mitogen-activated protein kinase 8
Synonyms:
JNK-46 JNK1-alpha-1 MK08_HUMAN PRKM8 SAPK1C c-Jun N-terminal kinase 1 c-Jun N-terminal kinase 1(JNK1) | c-Jun N-terminal kinase 2 (JNK2)
Type:
Enzyme
Mol. Mass.:
48297.57
Organism:
Homo sapiens (Human)
Description:
JNK-1 was purchased from Upstate Cell Signaling Solutions (formerly Upstate Biotechnology).
Residue:
427
  
Inhibitor
Name:
BDBM27817
Synonyms:
2-{[2-({1-[2-(dimethylamino)acetyl]-5-methoxy-2,3-dihydro-1H-indol-6-yl}amino)-7H-pyrrolo[2,3-d]pyrimidin-4-yl]amino}-6-fluoro-N-methylbenzamide | pyrrolo[2,3-d]pyrimidine deriv., 40
Type:
Small organic molecule
Emp. Form.:
C27H29FN8O3
Mol. Mass.:
532.5694
SMILES:
CNC(=O)c1c(F)cccc1Nc1nc(Nc2cc3N(CCc3cc2OC)C(=O)CN(C)C)nc2[nH]ccc12
:
Substrate
Name:
Biotin-GST-c-JUN
Synonyms:
JUN_RAT Rjg-9
Type:
Other Protein Type
Mol. Mass.:
8641.27
Organism:
Rattus norvegicus (rat)
Description:
GST-c-Jun (1-79) fusion protein was biotinylated.
Residue:
79