Target
Bromodomain-containing protein 4
Ligand
BDBM50260066
Substrate
Meas. Tech.
TR-FRET Assay (BD2: amino acids E352-E168)
Ki
1.70±n/a nM
Citation
 Dai, YFidanze, SDHasvold, LHolms, JLiu, DMcClellan, WMcDaniel, KMarjanovic, JSheppard, GWang, L Bromodomain inhibitors US Patent  US9957263 Publication Date 5/1/2018 
Target
Name:
Bromodomain-containing protein 4
Synonyms:
BRD4 Bromodomain-containing protein 4 (BRD4) Protein HUNK1
Type:
Protein
Mol. Mass.:
152264.84
Organism:
Homo sapiens (Human)
Description:
O60885
Residue:
1362
  
Inhibitor
Name:
BDBM50260066
Synonyms:
CHEMBL4067346 | US9957263, Example 4
Type:
Small organic molecule
Emp. Form.:
C27H28F2N4O5S
Mol. Mass.:
558.597
SMILES:
CCS(=O)(=O)Nc1cc(c(Oc2ccc(F)cc2F)cc1CN1CCOCC1)-c1cn(C)c(=O)c2[nH]ccc12
: