Target
Bromodomain-containing protein 4
Ligand
BDBM390754
Substrate
Meas. Tech.
TR-FRET Assay (BD1: amino acids K57-E168)
Ki
2.50±n/a nM
Citation
 Dai, YFidanze, SDHasvold, LHolms, JLiu, DMcClellan, WMcDaniel, KMarjanovic, JSheppard, GWang, L Bromodomain inhibitors US Patent  US9957263 Publication Date 5/1/2018 
Target
Name:
Bromodomain-containing protein 4
Synonyms:
BRD4 Bromodomain-containing protein 4 (BRD4) Protein HUNK1
Type:
Protein
Mol. Mass.:
152264.84
Organism:
Homo sapiens (Human)
Description:
O60885
Residue:
1362
  
Inhibitor
Name:
BDBM390754
Synonyms:
US9957263, Example 16
Type:
Small organic molecule
Emp. Form.:
C30H33F2N5O4S
Mol. Mass.:
597.676
SMILES:
CCS(=O)(=O)c1ccc(OCC2CC2(F)F)c(c1)-c1cn(C)c(=O)c2[nH]c(CN3CCN(CC3)c3ccncc3)cc12
: