Target
Bromodomain-containing protein 4
Ligand
BDBM50260068
Substrate
Meas. Tech.
TR-FRET Assay (BD2: amino acids E352-E168)
Ki
2.10±n/a nM
Citation
 Dai, YFidanze, SDHasvold, LHolms, JLiu, DMcClellan, WMcDaniel, KMarjanovic, JSheppard, GWang, L Bromodomain inhibitors US Patent  US9957263 Publication Date 5/1/2018 
Target
Name:
Bromodomain-containing protein 4
Synonyms:
BRD4 Bromodomain-containing protein 4 (BRD4) Protein HUNK1
Type:
Protein
Mol. Mass.:
152264.84
Organism:
Homo sapiens (Human)
Description:
O60885
Residue:
1362
  
Inhibitor
Name:
BDBM50260068
Synonyms:
CHEMBL4075943 | US9957263, Example 39
Type:
Small organic molecule
Emp. Form.:
C28H25N3O7S2
Mol. Mass.:
579.644
SMILES:
COc1ccc(cc1)S(=O)(=O)Nc1cccc(Oc2ccc(cc2-c2cn(C)c(=O)c3[nH]ccc23)S(C)(=O)=O)c1
: