Target
Bromodomain-containing protein 4
Ligand
BDBM390787
Substrate
Meas. Tech.
TR-FRET Assay (BD2: amino acids E352-E168)
Ki
1.000±n/a nM
Citation
 Dai, YFidanze, SDHasvold, LHolms, JLiu, DMcClellan, WMcDaniel, KMarjanovic, JSheppard, GWang, L Bromodomain inhibitors US Patent  US9957263 Publication Date 5/1/2018 
Target
Name:
Bromodomain-containing protein 4
Synonyms:
BRD4 Bromodomain-containing protein 4 (BRD4) Protein HUNK1
Type:
Protein
Mol. Mass.:
152264.84
Organism:
Homo sapiens (Human)
Description:
O60885
Residue:
1362
  
Inhibitor
Name:
BDBM390787
Synonyms:
US9957263, Example 49
Type:
Small organic molecule
Emp. Form.:
C23H21N3O6S2
Mol. Mass.:
499.559
SMILES:
CS(=O)(=O)c1ccc(Oc2cccc(NS(=O)(=O)C3CC3)c2)c(c1)-c1c[nH]c(=O)c2[nH]ccc12
: