Target
Bromodomain-containing protein 4
Ligand
BDBM390803
Substrate
Meas. Tech.
TR-FRET Assay (BD2: amino acids E352-E168)
Ki
1.70±n/a nM
Citation
 Dai, YFidanze, SDHasvold, LHolms, JLiu, DMcClellan, WMcDaniel, KMarjanovic, JSheppard, GWang, L Bromodomain inhibitors US Patent  US9957263 Publication Date 5/1/2018 
Target
Name:
Bromodomain-containing protein 4
Synonyms:
BRD4 Bromodomain-containing protein 4 (BRD4) Protein HUNK1
Type:
Protein
Mol. Mass.:
152264.84
Organism:
Homo sapiens (Human)
Description:
O60885
Residue:
1362
  
Inhibitor
Name:
BDBM390803
Synonyms:
US9957263, Example 66
Type:
Small organic molecule
Emp. Form.:
C28H25N3O5S
Mol. Mass.:
515.58
SMILES:
Cn1cc(-c2cc(ccc2Oc2cccc(NCc3cccc(O)c3)c2)S(C)(=O)=O)c2cc[nH]c2c1=O
: