Target
Bromodomain-containing protein 4
Ligand
BDBM390811
Substrate
Meas. Tech.
TR-FRET Assay (BD2: amino acids E352-E168)
Ki
1.40±n/a nM
Citation
 Dai, YFidanze, SDHasvold, LHolms, JLiu, DMcClellan, WMcDaniel, KMarjanovic, JSheppard, GWang, L Bromodomain inhibitors US Patent  US9957263 Publication Date 5/1/2018 
Target
Name:
Bromodomain-containing protein 4
Synonyms:
BRD4 Bromodomain-containing protein 4 (BRD4) Protein HUNK1
Type:
Protein
Mol. Mass.:
152264.84
Organism:
Homo sapiens (Human)
Description:
O60885
Residue:
1362
  
Inhibitor
Name:
BDBM390811
Synonyms:
US9957263, Example 74
Type:
Small organic molecule
Emp. Form.:
C33H36N4O5S
Mol. Mass.:
600.728
SMILES:
CN(C)CCCOc1ccc(CNc2cccc(Oc3ccc(cc3-c3cn(C)c(=O)c4[nH]ccc34)S(C)(=O)=O)c2)cc1
: