Target
Bromodomain-containing protein 4
Ligand
BDBM50260067
Substrate
Meas. Tech.
TR-FRET Assay (BD2: amino acids E352-E168)
Ki
0.600±n/a nM
Citation
 Dai, YFidanze, SDHasvold, LHolms, JLiu, DMcClellan, WMcDaniel, KMarjanovic, JSheppard, GWang, L Bromodomain inhibitors US Patent  US9957263 Publication Date 5/1/2018 
Target
Name:
Bromodomain-containing protein 4
Synonyms:
BRD4 Bromodomain-containing protein 4 (BRD4) Protein HUNK1
Type:
Protein
Mol. Mass.:
152264.84
Organism:
Homo sapiens (Human)
Description:
O60885
Residue:
1362
  
Inhibitor
Name:
BDBM50260067
Synonyms:
CHEMBL4078267 | US9957263, Example 78
Type:
Small organic molecule
Emp. Form.:
C30H28N4O5S
Mol. Mass.:
556.632
SMILES:
CC(=O)Nc1ccc(CNc2cccc(Oc3ccc(cc3-c3cn(C)c(=O)c4[nH]ccc34)S(C)(=O)=O)c2)cc1
: