Target
Bromodomain-containing protein 4
Ligand
BDBM390845
Substrate
Meas. Tech.
TR-FRET Assay (BD1: amino acids K57-E168)
Ki
1.60±n/a nM
Citation
 Dai, YFidanze, SDHasvold, LHolms, JLiu, DMcClellan, WMcDaniel, KMarjanovic, JSheppard, GWang, L Bromodomain inhibitors US Patent  US9957263 Publication Date 5/1/2018 
Target
Name:
Bromodomain-containing protein 4
Synonyms:
BRD4 Bromodomain-containing protein 4 (BRD4) Protein HUNK1
Type:
Protein
Mol. Mass.:
152264.84
Organism:
Homo sapiens (Human)
Description:
O60885
Residue:
1362
  
Inhibitor
Name:
BDBM390845
Synonyms:
US9957263, Example 109
Type:
Small organic molecule
Emp. Form.:
C28H30F2N4O3S
Mol. Mass.:
540.625
SMILES:
Cn1cc(-c2cc(ccc2N[C@H]2CC[C@@H](CC2)NCc2ccc(F)cc2F)S(C)(=O)=O)c2cc[nH]c2c1=O
: