Target
Bromodomain-containing protein 4
Ligand
BDBM390899
Substrate
Meas. Tech.
TR-FRET Assay (BD1: amino acids K57-E168)
Ki
1.64±n/a nM
Citation
 Dai, YFidanze, SDHasvold, LHolms, JLiu, DMcClellan, WMcDaniel, KMarjanovic, JSheppard, GWang, L Bromodomain inhibitors US Patent  US9957263 Publication Date 5/1/2018 
Target
Name:
Bromodomain-containing protein 4
Synonyms:
BRD4 Bromodomain-containing protein 4 (BRD4) Protein HUNK1
Type:
Protein
Mol. Mass.:
152264.84
Organism:
Homo sapiens (Human)
Description:
O60885
Residue:
1362
  
Inhibitor
Name:
BDBM390899
Synonyms:
N-{4-(2,4-difluorophenoxy)-3-[2-(3-methoxyprop-1-yn-1-yl)-6-methyl-7-oxo-6,7-dihydro-1H-pyrrolo[2,3-c]pyridin-4-yl]phenyl}ethanesulfonamide | US9957263, Example 163
Type:
Small organic molecule
Emp. Form.:
C26H23F2N3O5S
Mol. Mass.:
527.54
SMILES:
CCS(=O)(=O)Nc1ccc(Oc2c(F)cccc2F)c(c1)-c1cn(C)c(=O)c2[nH]c(cc12)C#CCOC
: