Target
Bromodomain-containing protein 4
Ligand
BDBM390914
Substrate
Meas. Tech.
TR-FRET Assay (BD2: amino acids E352-E168)
Ki
2.50±n/a nM
Citation
 Dai, YFidanze, SDHasvold, LHolms, JLiu, DMcClellan, WMcDaniel, KMarjanovic, JSheppard, GWang, L Bromodomain inhibitors US Patent  US9957263 Publication Date 5/1/2018 
Target
Name:
Bromodomain-containing protein 4
Synonyms:
BRD4 Bromodomain-containing protein 4 (BRD4) Protein HUNK1
Type:
Protein
Mol. Mass.:
152264.84
Organism:
Homo sapiens (Human)
Description:
O60885
Residue:
1362
  
Inhibitor
Name:
BDBM390914
Synonyms:
US9957263, Example 178
Type:
Small organic molecule
Emp. Form.:
C39H45N5O5
Mol. Mass.:
663.8051
SMILES:
CCNC(=O)c1cc2c(cn(C)c(=O)c2[nH]1)-c1ccc(cc1Oc1c(C)cccc1C)C(=O)N(CCN(CC)CC)c1ccccc1OC
: