Target
Bromodomain-containing protein 4
Ligand
BDBM390923
Substrate
Meas. Tech.
TR-FRET Assay (BD2: amino acids E352-E168)
Ki
2.52±n/a nM
Citation
 Dai, YFidanze, SDHasvold, LHolms, JLiu, DMcClellan, WMcDaniel, KMarjanovic, JSheppard, GWang, L Bromodomain inhibitors US Patent  US9957263 Publication Date 5/1/2018 
Target
Name:
Bromodomain-containing protein 4
Synonyms:
BRD4 Bromodomain-containing protein 4 (BRD4) Protein HUNK1
Type:
Protein
Mol. Mass.:
152264.84
Organism:
Homo sapiens (Human)
Description:
O60885
Residue:
1362
  
Inhibitor
Name:
BDBM390923
Synonyms:
US9957263, Example 187
Type:
Small organic molecule
Emp. Form.:
C34H42N4O5S
Mol. Mass.:
618.786
SMILES:
CN(CCCNC(=O)c1cc2c(cn(C)c(=O)c2[nH]1)-c1cc(ccc1Oc1c(C)cccc1C)S(C)(=O)=O)C1CCCCC1
: