Target
Insulin-like growth factor 1 receptor
Ligand
BDBM27826
Substrate
Biotinylated substrate peptide
Meas. Tech.
IGF-1R Inhibition Assay
pH
7.5±n/a
Temperature
295.15±n/a K
IC50
0.3±n/a nM
Citation
 Chamberlain, SDWilson, JWDeanda, FPatnaik, SRedman, AMYang, BShewchuk, LSabbatini, PLeesnitzer, MAGroy, AAtkins, CGerding, RHassell, AMLei, HMook, RAMoorthy, GRowand, JLStevens, KLKumar, RShotwell, JB Discovery of 4,6-bis-anilino-1H-pyrrolo[2,3-d]pyrimidines: potent inhibitors of the IGF-1R receptor tyrosine kinase. Bioorg Med Chem Lett 19:469-73 (2009)  
Target
Name:
Insulin-like growth factor 1 receptor
Synonyms:
CD_antigen=CD221 IGF1R Insulin-like growth factor 1 receptor (IGF1R) Insulin-like growth factor 1 receptor alpha chain Insulin-like growth factor I receptor | Insulin-like growth factor receptor (IGFR)
Type:
Protein
Mol. Mass.:
154776.79
Organism:
Homo sapiens (Human)
Description:
P08069
Residue:
1367
  
Inhibitor
Name:
BDBM27826
Synonyms:
4,6-bis-anilino-1H-pyrrolo[2,3-d]pyrimidine, 9 | 4-fluoro-2-[(2-{[2-methoxy-4-(1-propylpiperidin-4-yl)phenyl]amino}-7H-pyrrolo[2,3-d]pyrimidin-4-yl)amino]benzamide
Type:
Small organic molecule
Emp. Form.:
C28H32FN7O2
Mol. Mass.:
517.5978
SMILES:
CCCN1CCC(CC1)c1ccc(Nc2nc(Nc3cc(F)ccc3C(N)=O)c3cc[nH]c3n2)c(OC)c1
:
Substrate
Name:
Biotinylated substrate peptide
Synonyms:
Type:
Peptide
Mol. Mass.:
3542.16
Organism:
Description:
Residue:
29