Target
Neutrophil collagenase
Ligand
BDBM27877
Substrate
OmniMMP Substrate
Meas. Tech.
Enzyme Assay and Determination of the Inhibition Constants IC50
pH
7.5±n/a
Temperature
295.15±n/a K
IC50
57±n/a nM
Citation
 Pochetti, GMontanari, RGege, CChevrier, CTaveras, AGMazza, F Extra Binding Region Induced by Non-Zinc Chelating Inhibitors into the S(1)' Subsite of Matrix Metalloproteinase 8 (MMP-8) (dagger). J Med Chem 52:1040-9 (2009)  
Target
Name:
Neutrophil collagenase
Synonyms:
CLG1 MMP8 Matrix metalloproteinase-8 PMNL collagenase | PMNL-CL
Type:
Enzyme
Mol. Mass.:
53413.48
Organism:
Homo sapiens (Human)
Description:
P22894
Residue:
467
  
Inhibitor
Name:
BDBM27877
Synonyms:
N-{[2-(2-amino-3,4-dioxocyclobut-1-en-1-yl)-1,2,3,4-tetrahydroisoquinolin-7-yl]methyl}-3,11,11-trioxo-8,1-dithia-4,6-diazatricyclo[7.4.0.0^{2,7}]trideca-1(9),2(7),5-triene-5-carboxamide | thiopyranothienopyrimidine, 1
Type:
Small organic molecule
Emp. Form.:
C24H21N5O6S2
Mol. Mass.:
539.583
SMILES:
Nc1c(N2CCc3ccc(CNC(=O)c4nc5sc6CS(=O)(=O)CCc6c5c(=O)[nH]4)cc3C2)c(=O)c1=O
:
Substrate
Name:
OmniMMP Substrate
Synonyms:
Type:
Peptide
Mol. Mass.:
2468.31
Organism:
Description:
Dpa = 3-(2,4-dinitrophenyl)-L-2,3-diaminopropionyl. It is From Biomol, Hamburg, Germany.
Residue:
23