Target
Insulin-like growth factor 1 receptor
Ligand
BDBM28092
Substrate
Biotinylated substrate peptide
Meas. Tech.
In Vitro Kinase Inhibition Assay
pH
7.5±n/a
Temperature
295.15±n/a K
IC50
30±n/a nM
Citation
 Miller, LMMayer, SCBerger, DMBoschelli, DHBoschelli, FDi, LDu, XDutia, MFloyd, MBJohnson, MKenny, CHKrishnamurthy, GMoy, FPetusky, STkach, DTorres, NWu, BXu, W Lead identification to generate 3-cyanoquinoline inhibitors of insulin-like growth factor receptor (IGF-1R) for potential use in cancer treatment. Bioorg Med Chem Lett 19:62-6 (2009)  
Target
Name:
Insulin-like growth factor 1 receptor
Synonyms:
CD_antigen=CD221 IGF1R Insulin-like growth factor 1 receptor (IGF1R) Insulin-like growth factor 1 receptor alpha chain Insulin-like growth factor I receptor | Insulin-like growth factor receptor (IGFR)
Type:
Protein
Mol. Mass.:
154776.79
Organism:
Homo sapiens (Human)
Description:
P08069
Residue:
1367
  
Inhibitor
Name:
BDBM28092
Synonyms:
3-cyanoquinoline, 17 | 4-({3-bromo-4-[(1,4,5-trimethyl-1H-imidazol-2-yl)sulfanyl]phenyl}amino)-7-{[3-(dimethylamino)propyl]amino}-6-methoxyquinoline-3-carbonitrile
Type:
Small organic molecule
Emp. Form.:
C28H32BrN7OS
Mol. Mass.:
594.569
SMILES:
COc1cc2c(Nc3ccc(Sc4nc(C)c(C)n4C)c(Br)c3)c(cnc2cc1NCCCN(C)C)C#N
:
Substrate
Name:
Biotinylated substrate peptide
Synonyms:
Type:
Peptide
Mol. Mass.:
2453.64
Organism:
Description:
Residue:
19
ITINNHTRDIYETDYYRKH