Target
Glutamate receptor ionotropic, NMDA 2A
Ligand
BDBM393143
Substrate
Meas. Tech.
Biological Assay
IC50
2000±n/a nM
Citation
 Anderson, DRVolkmann, RA N-arylmethyl sulfonamide negative modulators of NR2A US Patent  US9963434 Publication Date 5/8/2018 
Target
Name:
Glutamate receptor ionotropic, NMDA 2A
Synonyms:
GRIN2A Glutamate [NMDA] receptor Glutamate [NMDA] receptor subunit epsilon-1 NMDA receptor subtype 2A protein (NR2A) NMDE1_HUMAN hNR2A
Type:
Mol. Mass.:
165293.76
Organism:
Homo sapiens (Human)
Description:
Residue:
1464
  
Inhibitor
Name:
BDBM393143
Synonyms:
5-(3-chloro-4- fluorobenzenesulfon- amidomethyl)-N-[(6- methoxypyridin-3- yl)methyl]pyridine-2- carboxamide | US9963434, Table 12.88
Type:
Small organic molecule
Emp. Form.:
C20H18ClFN4O4S
Mol. Mass.:
464.898
SMILES:
COc1ccc(CNC(=O)c2ccc(CNS(=O)(=O)c3ccc(F)c(Cl)c3)cn2)cn1
: