Target
Glutamate receptor ionotropic, NMDA 2A
Ligand
BDBM393146
Substrate
Meas. Tech.
Biological Assay
IC50
2550±n/a nM
Citation
 Anderson, DRVolkmann, RA N-arylmethyl sulfonamide negative modulators of NR2A US Patent  US9963434 Publication Date 5/8/2018 
Target
Name:
Glutamate receptor ionotropic, NMDA 2A
Synonyms:
GRIN2A Glutamate [NMDA] receptor Glutamate [NMDA] receptor subunit epsilon-1 NMDA receptor subtype 2A protein (NR2A) NMDE1_HUMAN hNR2A
Type:
Mol. Mass.:
165293.76
Organism:
Homo sapiens (Human)
Description:
Residue:
1464
  
Inhibitor
Name:
BDBM393146
Synonyms:
5-(3-chloro-4- fluorobenzenesulfon- amidomethyl)-N-[(1- methyl-1H-pyrrol-2- yl)methyl]pyridine-2- carboxamide | US9963434, Table 12.91
Type:
Small organic molecule
Emp. Form.:
C19H18ClFN4O3S
Mol. Mass.:
436.888
SMILES:
Cn1cccc1CNC(=O)c1ccc(CNS(=O)(=O)c2ccc(F)c(Cl)c2)cn1
: