Target
Glutamate receptor ionotropic, NMDA 2A
Ligand
BDBM393203
Substrate
Meas. Tech.
Biological Assay
IC50
1040±n/a nM
Citation
 Anderson, DRVolkmann, RA N-arylmethyl sulfonamide negative modulators of NR2A US Patent  US9963434 Publication Date 5/8/2018 
Target
Name:
Glutamate receptor ionotropic, NMDA 2A
Synonyms:
GRIN2A Glutamate [NMDA] receptor Glutamate [NMDA] receptor subunit epsilon-1 NMDA receptor subtype 2A protein (NR2A) NMDE1_HUMAN hNR2A
Type:
Mol. Mass.:
165293.76
Organism:
Homo sapiens (Human)
Description:
Residue:
1464
  
Inhibitor
Name:
BDBM393203
Synonyms:
5-(3- chlorobenzenesulfon- amidomethyl)-N-[(2- methyl-1,3-thiazol-5- yl)methyl]pyridine-2- carboxamide | US9963434, Table 12.146
Type:
Small organic molecule
Emp. Form.:
C18H17ClN4O3S2
Mol. Mass.:
436.936
SMILES:
Cc1ncc(CNC(=O)c2ccc(CNS(=O)(=O)c3cccc(Cl)c3)cn2)s1
: