Target
Cholesterol 24-hydroxylase
Ligand
BDBM393291
Substrate
Meas. Tech.
Inhibitory Assay
IC50
6.90±n/a nM
Citation
 Koike, TIkeda, S Radiolabeled compounds US Patent  US9963443 Publication Date 5/8/2018 
Target
Name:
Cholesterol 24-hydroxylase
Synonyms:
CP46A_HUMAN CYP46A1 | Cholesterol 24-hydroxylase (CH24H)
Type:
Protein
Mol. Mass.:
56834.45
Organism:
Homo sapiens (Human)
Description:
Q9Y6A2
Residue:
500
  
Inhibitor
Name:
BDBM393291
Synonyms:
US9963443, Reference Example 20
Type:
Small organic molecule
Emp. Form.:
C17H19BrFN5O
Mol. Mass.:
408.268
SMILES:
FC1CN(C1)C(=O)C1CCN(CC1)c1cnccc1-n1cc(Br)cn1
: