Target
Sigma non-opioid intracellular receptor 1
Ligand
BDBM393457
Substrate
Meas. Tech.
Receptor Radioligand Assay
Ki
22.2±n/a nM
Citation
 Merce-Vidal, RDíaz-Fernández, JAlmansa-Rosales, C Substituted pyrazino[1,2-a]indoles as sigma receptor activity modulators US Patent  US9963453 Publication Date 5/8/2018 
Target
Name:
Sigma non-opioid intracellular receptor 1
Synonyms:
Aging-associated gene 8 protein SGMR1_HUMAN SIGMAR1 SR31747-binding protein Sigma 1-type opioid receptor Sigma1R | hSigmaR1
Type:
Enzyme Catalytic Domain
Mol. Mass.:
25124.85
Organism:
Homo sapiens (Human)
Description:
Q99720
Residue:
223
  
Inhibitor
Name:
BDBM393457
Synonyms:
1-(8-fluoro- 3,4- dihydro- pyrazino[1,2- a]indol- 2(1H)-yl)-4- (piperidin-1- yl)butan-1- one | US9963453, 16
Type:
Small organic molecule
Emp. Form.:
C20H26FN3O
Mol. Mass.:
343.4383
SMILES:
Fc1ccc2n3CCN(Cc3cc2c1)C(=O)CCCN1CCCCC1
: