Target
Sigma non-opioid intracellular receptor 1
Ligand
BDBM393462
Substrate
Meas. Tech.
Receptor Radioligand Assay
Ki
292±n/a nM
Citation
 Merce-Vidal, RDíaz-Fernández, JAlmansa-Rosales, C Substituted pyrazino[1,2-a]indoles as sigma receptor activity modulators US Patent  US9963453 Publication Date 5/8/2018 
Target
Name:
Sigma non-opioid intracellular receptor 1
Synonyms:
Aging-associated gene 8 protein SGMR1_HUMAN SIGMAR1 SR31747-binding protein Sigma 1-type opioid receptor Sigma1R | hSigmaR1
Type:
Enzyme Catalytic Domain
Mol. Mass.:
25124.85
Organism:
Homo sapiens (Human)
Description:
Q99720
Residue:
223
  
Inhibitor
Name:
BDBM393462
Synonyms:
1-(3,4- dihydro- pyrazino[1,2- a]indol- 2(1H)-yl)-4- (4- methyl-piperazin-1-yl)butan-1-one | US9963453, 22
Type:
Small organic molecule
Emp. Form.:
C20H28N4O
Mol. Mass.:
340.4625
SMILES:
CN1CCN(CCCC(=O)N2CCn3c(C2)cc2ccccc32)CC1
: