Target
Sigma non-opioid intracellular receptor 1
Ligand
BDBM393467
Substrate
Meas. Tech.
Receptor Radioligand Assay
Ki
125±n/a nM
Citation
 Merce-Vidal, RDíaz-Fernández, JAlmansa-Rosales, C Substituted pyrazino[1,2-a]indoles as sigma receptor activity modulators US Patent  US9963453 Publication Date 5/8/2018 
Target
Name:
Sigma non-opioid intracellular receptor 1
Synonyms:
Aging-associated gene 8 protein SGMR1_HUMAN SIGMAR1 SR31747-binding protein Sigma 1-type opioid receptor Sigma1R | hSigmaR1
Type:
Enzyme Catalytic Domain
Mol. Mass.:
25124.85
Organism:
Homo sapiens (Human)
Description:
Q99720
Residue:
223
  
Inhibitor
Name:
BDBM393467
Synonyms:
2-(4- ethylpiperazin- 1-yl)-1-(8- fluoro-3,4- dihydro- pyrazino[1,2- a]indol-2(1H)-yl)propan-1-one | US9963453, 29
Type:
Small organic molecule
Emp. Form.:
C20H27FN4O
Mol. Mass.:
358.453
SMILES:
CCN1CCN(CC1)C(C)C(=O)N1CCn2c(C1)cc1cc(F)ccc21
: