Target
Sigma non-opioid intracellular receptor 1
Ligand
BDBM393472
Substrate
Meas. Tech.
Receptor Radioligand Assay
Ki
500±n/a nM
Citation
 Merce-Vidal, RDíaz-Fernández, JAlmansa-Rosales, C Substituted pyrazino[1,2-a]indoles as sigma receptor activity modulators US Patent  US9963453 Publication Date 5/8/2018 
Target
Name:
Sigma non-opioid intracellular receptor 1
Synonyms:
Aging-associated gene 8 protein SGMR1_HUMAN SIGMAR1 SR31747-binding protein Sigma 1-type opioid receptor Sigma1R | hSigmaR1
Type:
Enzyme Catalytic Domain
Mol. Mass.:
25124.85
Organism:
Homo sapiens (Human)
Description:
Q99720
Residue:
223
  
Inhibitor
Name:
BDBM393472
Synonyms:
2-(1,4'- bipiperidin-1'- yl)-1-(3,4- dihydro- pyrazino[1,2- a]indol- 2(1H)- yl)propan-1-one | US9963453, 37
Type:
Small organic molecule
Emp. Form.:
C24H34N4O
Mol. Mass.:
394.553
SMILES:
CC(N1CCC(CC1)N1CCCCC1)C(=O)N1CCn2c(C1)cc1ccccc21
: