Target
Sigma non-opioid intracellular receptor 1
Ligand
BDBM393474
Substrate
Meas. Tech.
Receptor Radioligand Assay
Ki
427±n/a nM
Citation
 Merce-Vidal, RDíaz-Fernández, JAlmansa-Rosales, C Substituted pyrazino[1,2-a]indoles as sigma receptor activity modulators US Patent  US9963453 Publication Date 5/8/2018 
Target
Name:
Sigma non-opioid intracellular receptor 1
Synonyms:
Aging-associated gene 8 protein SGMR1_HUMAN SIGMAR1 SR31747-binding protein Sigma 1-type opioid receptor Sigma1R | hSigmaR1
Type:
Enzyme Catalytic Domain
Mol. Mass.:
25124.85
Organism:
Homo sapiens (Human)
Description:
Q99720
Residue:
223
  
Inhibitor
Name:
BDBM393474
Synonyms:
1-(3,4- dihydro- pyrazino[1,2- a]indol- 2(1H)-yl)-2- ((2- (dimethyl-amino)ethyl)(methyl)amino)butan-1-one | US9963453, 39
Type:
Small organic molecule
Emp. Form.:
C20H30N4O
Mol. Mass.:
342.4784
SMILES:
CCC(N(C)CCN(C)C)C(=O)N1CCn2c(C1)cc1ccccc21
: