Target
Sigma non-opioid intracellular receptor 1
Ligand
BDBM393476
Substrate
Meas. Tech.
Receptor Radioligand Assay
Ki
151±n/a nM
Citation
 Merce-Vidal, RDíaz-Fernández, JAlmansa-Rosales, C Substituted pyrazino[1,2-a]indoles as sigma receptor activity modulators US Patent  US9963453 Publication Date 5/8/2018 
Target
Name:
Sigma non-opioid intracellular receptor 1
Synonyms:
Aging-associated gene 8 protein SGMR1_HUMAN SIGMAR1 SR31747-binding protein Sigma 1-type opioid receptor Sigma1R | hSigmaR1
Type:
Enzyme Catalytic Domain
Mol. Mass.:
25124.85
Organism:
Homo sapiens (Human)
Description:
Q99720
Residue:
223
  
Inhibitor
Name:
BDBM393476
Synonyms:
4-(dimethyl- amino)-1- (3,4,10,10a- tetrahydro- pyrazino[1,2- a]indol- 2(1H)- yl)butan-1- one | US9963453, 43
Type:
Small organic molecule
Emp. Form.:
C17H25N3O
Mol. Mass.:
287.3999
SMILES:
CN(C)CCCC(=O)N1CCN2C(Cc3ccccc23)C1
: