Target
Dipeptidyl peptidase 1
Ligand
BDBM150338
Substrate
Meas. Tech.
Inhibition Assay of Human DPPI (Cathepsin C)
pH
6±n/a
Temperature
298.15±n/a K
IC50
1.90±n/a nM
Comments
extracted
Citation
 Anderskewitz, RBinder, FGrauert, MGrundl, MHaebel, PWOost, TPautsch, APeters, SVintonyak, V Methods for treating pulmonary emphysema using substituted 2-Aza-bicyclo[2.2.1]heptane-3-carboxylic acid (benzyl-cyano-methyl)-amides inhibitors of cathepsin C US Patent  US9713606 Publication Date 7/25/2017 
Target
Name:
Dipeptidyl peptidase 1
Synonyms:
CATC_HUMAN CTSC Cathepsin J Dipeptidyl peptidase 1 (DPPI) Dipeptidyl peptidase I (DPPI)
Type:
Enzyme
Mol. Mass.:
51857.28
Organism:
Homo sapiens (Human)
Description:
P53634
Residue:
463
  
Inhibitor
Name:
BDBM150338
Synonyms:
US10238633, Example 12 US9713606, 12
Type:
Small organic molecule
Emp. Form.:
C23H23F2N3O3S
Mol. Mass.:
459.509
SMILES:
CS(=O)(=O)c1ccc(cc1F)-c1ccc(C[C@H](NC(=O)[C@H]2N[C@@H]3CC[C@H]2C3)C#N)c(F)c1
: