Target
Dipeptidyl peptidase 1
Ligand
BDBM150648
Substrate
Meas. Tech.
Inhibition Assay of Human DPPI (Cathepsin C)
pH
6±n/a
Temperature
298.15±n/a K
IC50
0.800±n/a nM
Comments
extracted
Citation
 Anderskewitz, RBinder, FGrauert, MGrundl, MHaebel, PWOost, TPautsch, APeters, SVintonyak, V Methods for treating pulmonary emphysema using substituted 2-Aza-bicyclo[2.2.1]heptane-3-carboxylic acid (benzyl-cyano-methyl)-amides inhibitors of cathepsin C US Patent  US9713606 Publication Date 7/25/2017 
Target
Name:
Dipeptidyl peptidase 1
Synonyms:
CATC_HUMAN CTSC Cathepsin J Dipeptidyl peptidase 1 (DPPI) Dipeptidyl peptidase I (DPPI)
Type:
Enzyme
Mol. Mass.:
51857.28
Organism:
Homo sapiens (Human)
Description:
P53634
Residue:
463
  
Inhibitor
Name:
BDBM150648
Synonyms:
US10238633, Example 322 US9713606, 322
Type:
Small organic molecule
Emp. Form.:
C23H21FN4O2
Mol. Mass.:
404.4368
SMILES:
Fc1cc2c3ccccc3[nH]c(=O)c2cc1C[C@H](NC(=O)[C@H]1N[C@@H]2CC[C@H]1C2)C#N
: