Target
Kappa-type opioid receptor
Ligand
BDBM393487
Substrate
Meas. Tech.
[35S] GTPgammaS binding test
EC50
0.0028±0 nM
Citation
 Nagase, HYamamoto, N Morphinan derivative US Patent  US9963460 Publication Date 5/8/2018 
Target
Name:
Kappa-type opioid receptor
Synonyms:
K-OR-1 Kappa-opioid receptor (KOR) Kappa-type opioid receptor (KOR) OPIATE Kappa OPRK1 kappa opioid receptor (KOR)
Type:
G Protein-Coupled Receptor (GPCR)
Mol. Mass.:
42648.76
Organism:
Homo sapiens (Human)
Description:
P41145
Residue:
380
  
Inhibitor
Name:
BDBM393487
Synonyms:
US9963460, 13
Type:
Small organic molecule
Emp. Form.:
C31H34N2O4
Mol. Mass.:
498.6127
SMILES:
CN(Cc1ccccc1)C(=O)C1=C[C@]23CC[C@]1(O)[C@@H]1Oc4c5c(C[C@H]2N(CC2CC2)CC[C@@]315)ccc4O
: