Target
D(3) dopamine receptor
Ligand
BDBM50057776
Substrate
Meas. Tech.
Radioligand Binding Assay
Ki
35.6±1.4 nM
Citation
 Ananthan, S Urea and amide derivatives of aminoalkylpiperazines and use thereof US Patent  US9969743 Publication Date 5/15/2018 
Target
Name:
D(3) dopamine receptor
Synonyms:
DOPAMINE D3 DRD3_HUMAN Dopamine D3 receptor (D3) Dopamine receptor Dopamine receptor D3
Type:
Mol. Mass.:
44243.43
Organism:
Homo sapiens (Human)
Description:
Residue:
400
  
Inhibitor
Name:
BDBM50057776
Synonyms:
CHEMBL3323116 US9969743, 109
Type:
Small organic molecule
Emp. Form.:
C30H43F3N6O
Mol. Mass.:
560.6972
SMILES:
CC(C)(C)c1nc(cc(n1)C(F)(F)F)N1CCN(CCCCNC(=O)C2CCN(Cc3ccccc3)CC2)CC1
: