Target
Sterol 14-alpha demethylase
Ligand
BDBM29343
Substrate
BDBM10852
Meas. Tech.
Spectral Titration of TCCYP51
pH
7.4±n/a
Temperature
297.15±n/a K
Kd
7600±900 nM
Citation
 Konkle, MEHargrove, TYKleshchenko, YYvon Kries, JPRidenour, WUddin, MJCaprioli, RMMarnett, LJNes, WDVillalta, FWaterman, MRLepesheva, GI Indomethacin amides as a novel molecular scaffold for targeting Trypanosoma cruzi sterol 14alpha-demethylase. J Med Chem 52:2846-53 (2009)  
Target
Name:
Sterol 14-alpha demethylase
Synonyms:
CP51_TRYCC Cytochrome P450 51 Sterol 14α-demethylase (CYP51) Sterol 14-alpha demethylase (CYP51) | Tc14DM
Type:
Protein
Mol. Mass.:
54690.12
Organism:
Trypanosoma cruzi
Description:
Q7Z1V1
Residue:
481
  
Inhibitor
Name:
BDBM29343
Synonyms:
Indomethacin-amide derivative, 13
Type:
Small organic molecule
Emp. Form.:
C25H22ClN3O3
Mol. Mass.:
447.913
SMILES:
COc1ccc2n(C(=O)c3ccc(Cl)cc3)c(C)c(CC(=O)Nc3cccnc3C)c2c1
:
Substrate