Target
Histone deacetylase
Ligand
BDBM29603
Substrate
pfHDAC-1 Substrate
Meas. Tech.
pfHDAC-1 Enzyme Assay
pH
7.5±n/a
Temperature
296.15±n/a K
IC50
36±6 nM
Km
30000±2000 nM
kcat
0.19±0.01 1/sec
Citation
 Patel, VMazitschek, RColeman, BNguyen, CUrgaonkar, SCortese, JBarker, RHGreenberg, ETang, WBradner, JESchreiber, SLDuraisingh, MTWirth, DFClardy, J Identification and characterization of small molecule inhibitors of a class I histone deacetylase from Plasmodium falciparum. J Med Chem 52:2185-7 (2009)  
Target
Name:
Histone deacetylase
Synonyms:
Histone Deacetylase (pfHDAC-1)
Type:
Enzyme
Mol. Mass.:
51371.91
Organism:
Plasmodium falciparum (isolate 3D7)
Description:
Assays were performed using recombinant pfHDAC-1 expressed and purified from S2 insect cells.
Residue:
449
  
Inhibitor
Name:
BDBM29603
Synonyms:
benzylidenehydrazine derivative, 20
Type:
Small organic molecule
Emp. Form.:
C13H17BrN4O3
Mol. Mass.:
357.203
SMILES:
ONC(=O)CCCCCC(=O)NN=Cc1cccnc1Br
:
Substrate
Name:
pfHDAC-1 Substrate
Synonyms:
Type:
fluorogenic, acetylated peptide
Mol. Mass.:
1609.93
Organism:
Description:
Residue:
15
ACLEGLYLYSACAMC