Target
11-beta-hydroxysteroid dehydrogenase 1
Ligand
BDBM29860
Substrate
BDBM13739
Meas. Tech.
Measurement of 11beta-HSD1 Activity
pH
8±n/a
Temperature
295.15±n/a K
Ki
4±n/a nM
Comments
99% inhibition @ 0.1 uM.
Citation
 Siu, MJohnson, TOWang, YNair, SKTaylor, WDCripps, SJMatthews, JJEdwards, MPPauly, TAErmolieff, JCastro, AHosea, NALaPaglia, AFanjul, ANVogel, JE N-(Pyridin-2-yl) arylsulfonamide inhibitors of 11beta-hydroxysteroid dehydrogenase type 1: Discovery of PF-915275. Bioorg Med Chem Lett 19:3493-7 (2009)  
Target
Name:
11-beta-hydroxysteroid dehydrogenase 1
Synonyms:
11-DH 11-beta-Hydroxysteroid Dehydrogenase 1 (11-beta-HSD1) 11-beta-hydroxysteroid dehydrogenase 1 (11HSD1) Corticosteroid 11-beta-dehydrogenase isozyme 1 (11-beta-HSD-1) Corticosteroid 11-beta-dehydrogenase isozyme 1 (11beta-HSD1) HSD11 HSD11L | SDR26C1
Type:
Enzyme
Mol. Mass.:
32409.16
Organism:
Homo sapiens (Human)
Description:
P28845
Residue:
292
  
Inhibitor
Name:
BDBM29860
Synonyms:
N-(Pyridin-2-yl) arylsulfonamide, 22
Type:
Small organic molecule
Emp. Form.:
C19H15N3O2S
Mol. Mass.:
349.406
SMILES:
Cc1cccc(NS(=O)(=O)c2ccc(cc2)-c2ccc(cc2)C#N)n1
:
Substrate
Name:
BDBM13739
Synonyms:
(1S,2R,10S,11S,14R,15S)-14-hydroxy-14-(2-hydroxyacetyl)-2,15-dimethyltetracyclo[8.7.0.0^{2,7}.0^{11,15}]heptadec-6-ene-5,17-dione [3H]cortisone | cortisone
Type:
Steroid
Emp. Form.:
C21H28O5
Mol. Mass.:
360.444
SMILES:
[H][C@@]12CC[C@](O)(C(=O)CO)[C@@]1(C)CC(=O)[C@@]1([H])[C@@]2([H])CCC2=CC(=O)CC[C@]12C
: