Target
Cyclin-dependent kinase 4/G1/S-specific cyclin-D1
Ligand
BDBM395790
Substrate
Meas. Tech.
CDK Assay
IC50
<10±n/a nM
Citation
 Cheng, PCao, W Preparation and use of kinase inhibitor US Patent  US10308654 Publication Date 6/4/2019 
Target
Name:
Cyclin-dependent kinase 4/G1/S-specific cyclin-D1
Synonyms:
CDK4/CyclinD1 | cdk4
Type:
Protein
Mol. Mass.:
Description:
Components:
This complex has 2 components.
Component 1
Name:
Cyclin-dependent kinase 4
Synonyms:
CDK4 Cell division protein kinase 4 PSK-J3
Type:
Enzyme Subunit
Mol. Mass.:
33731.96
Organism:
Homo sapiens (Human)
Description:
P11802
Residue:
303
  
Component 2
Name:
G1/S-specific cyclin-D1
Synonyms:
CCND1_MOUSE Cyclin D1 | Cyl-1
Type:
Enzyme Subunit
Mol. Mass.:
33418.84
Organism:
Mus musculus (mouse)
Description:
Residue:
295
  
Inhibitor
Name:
BDBM395790
Synonyms:
US10308654, Example 18
Type:
Small organic molecule
Emp. Form.:
C22H29N9O
Mol. Mass.:
435.5254
SMILES:
CNC(=O)c1cc2cnc(Nc3ccc(cn3)N3CCNCC3)nc2n1N1CCCCC1
: