Target
Bile acid receptor
Ligand
BDBM21724
Substrate
BDBM10852
Meas. Tech.
FXR Transient Transfection Assay
EC50
65±n/a nM
Comments
100% efficacy.
Citation
 Akwabi-Ameyaw, ABass, JYCaldwell, RDCaravella, JAChen, LCreech, KLDeaton, DNJones, SAKaldor, ILiu, YMadauss, KPMarr, HBMcFadyen, RBMiller, ABIii, FNParks, DJSpearing, PKTodd, DWilliams, SPWisely, GB Conformationally constrained farnesoid X receptor (FXR) agonists: Naphthoic acid-based analogs of GW 4064. Bioorg Med Chem Lett 18:4339-43 (2008)  
Target
Name:
Bile acid receptor
Synonyms:
BAR FXR HRR1 NR1H4_HUMAN RIP14 Retinoid X receptor-interacting protein 14 | farnesoid x receptor
Type:
Nuclear Receptor
Mol. Mass.:
55916.24
Organism:
Homo sapiens (Human)
Description:
Q96RI1
Residue:
486
  
Inhibitor
Name:
BDBM21724
Synonyms:
3-[(E)-2-(2-chloro-4-{[3-(2,6-dichlorophenyl)-5-(1-methylethyl)isoxazol-4-yl]methoxy}phenyl)ethenyl]benzoic acid CHEMBL318457 | GW-4064
Type:
Small organic molecule
Emp. Form.:
C28H22Cl3NO4
Mol. Mass.:
542.838
SMILES:
CC(C)c1onc(c1COc1ccc(\C=C\c2cccc(c2)C(O)=O)c(Cl)c1)-c1c(Cl)cccc1Cl
:
Substrate