Target
TGF-beta receptor type-1 [T204D]
Ligand
BDBM396683
Substrate
Meas. Tech.
Biological Assay
IC50
1.000±n/a nM
Citation
 Ding, PGelman, MKinsella, TSingh, RBhamidipati, SVelaparthi, UBorzilleri, RMRahaman, HWarrier, JS GDF-8 inhibitors US Patent  US9981944 Publication Date 5/29/2018 
Target
Name:
TGF-beta receptor type-1 [T204D]
Synonyms:
ALK5 TGF-beta receptor type-1 (T204D) TGFBR1 TGFR-1 (T204D) | TGFR1_HUMAN
Type:
Mol. Mass.:
55981.22
Organism:
Homo sapiens (Human)
Description:
P36897[T204D]
Residue:
503
  
Inhibitor
Name:
BDBM396683
Synonyms:
6-(6'-(difluoromethyl)-[2,2'-bipyridin]-3- yl)imidazo[1,2-a]pyridine-3-carboxamide | US9981944, Example 29
Type:
Small organic molecule
Emp. Form.:
C19H13F2N5O
Mol. Mass.:
365.3362
SMILES:
NC(=O)c1cnc2ccc(cn12)-c1cccnc1-c1cccc(n1)C(F)F
: