Target
TGF-beta receptor type-2
Ligand
BDBM396683
Substrate
Meas. Tech.
Biological Assay
IC50
>15000±n/a nM
Citation
 Ding, PGelman, MKinsella, TSingh, RBhamidipati, SVelaparthi, UBorzilleri, RMRahaman, HWarrier, JS GDF-8 inhibitors US Patent  US9981944 Publication Date 5/29/2018 
Target
Name:
TGF-beta receptor type-2
Synonyms:
TGF-beta receptor type II TGFR2_HUMAN
Type:
PROTEIN
Mol. Mass.:
64559.49
Organism:
Homo sapiens (Human)
Description:
ChEMBL_586859
Residue:
567
  
Inhibitor
Name:
BDBM396683
Synonyms:
6-(6'-(difluoromethyl)-[2,2'-bipyridin]-3- yl)imidazo[1,2-a]pyridine-3-carboxamide | US9981944, Example 29
Type:
Small organic molecule
Emp. Form.:
C19H13F2N5O
Mol. Mass.:
365.3362
SMILES:
NC(=O)c1cnc2ccc(cn12)-c1cccnc1-c1cccc(n1)C(F)F
: