Target
5-hydroxytryptamine receptor 1A
Ligand
BDBM31004
Substrate
Not Available
Meas. Tech.
Dose Response Assay for Agonists of 5-Hydroxytryptamine (Serotonin) Receptor Subtype 1A (5HT1A)
pH
7.4±n/a
Temperature
296.15±n/a K
EC50
50000±n/a nM
Citation
 PubChem, PC Dose Response assay for agonists of 5-Hydroxytryptamine (Serotonin) Receptor Subtype 1A (5HT1A) PubChem Bioassay (2007)[AID] 
Target
Name:
5-hydroxytryptamine receptor 1A
Synonyms:
5-HT-1A 5-hydroxytryptamine receptor 1A (5-HT-1A) ADRB2RL1 Dopamine D2 receptor and serotonin 1a receptor HTR1A | Serotonin receptor 1A
Type:
Mol. Mass.:
46122.49
Organism:
Homo sapiens (Human)
Description:
Residue:
422
  
Inhibitor
Name:
BDBM31004
Synonyms:
MLS000030962 N-[2-(cyclopentylamino)-2-keto-ethyl]-N-(3,4-dimethoxyphenyl)-2-[5-(p-tolyl)tetrazol-2-yl]acetamide N-[2-(cyclopentylamino)-2-oxoethyl]-N-(3,4-dimethoxyphenyl)-2-[5-(4-methylphenyl)-2-tetrazolyl]acetamide SMR000002705 | cid_655193
Type:
Small organic molecule
Emp. Form.:
C25H30N6O4
Mol. Mass.:
478.5435
SMILES:
COc1ccc(cc1OC)N(CC(=O)NC1CCCC1)C(=O)Cn1nnc(n1)-c1ccc(C)cc1
:
Substrate
Name:
Not Available
Synonyms:
Type:
Mol. Mass.:
358.43
Organism:
Description:
Residue:
3
NA