Target
5-hydroxytryptamine receptor 1A
Ligand
BDBM31011
Substrate
Not Available
Meas. Tech.
Dose Response Assay for Agonists of 5-Hydroxytryptamine (Serotonin) Receptor Subtype 1A (5HT1A)
pH
7.4±n/a
Temperature
296.15±n/a K
EC50
50000±n/a nM
Citation
 PubChem, PC Dose Response assay for agonists of 5-Hydroxytryptamine (Serotonin) Receptor Subtype 1A (5HT1A) PubChem Bioassay (2007)[AID] 
Target
Name:
5-hydroxytryptamine receptor 1A
Synonyms:
5-HT-1A 5-hydroxytryptamine receptor 1A (5-HT-1A) ADRB2RL1 Dopamine D2 receptor and serotonin 1a receptor HTR1A | Serotonin receptor 1A
Type:
Mol. Mass.:
46122.49
Organism:
Homo sapiens (Human)
Description:
Residue:
422
  
Inhibitor
Name:
BDBM31011
Synonyms:
3-cyclopentylpropanoic acid [2-[(5-chloro-2-pyridinyl)amino]-2-oxoethyl] ester MLS000058422 [2-[(5-chloranylpyridin-2-yl)amino]-2-oxidanylidene-ethyl] 3-cyclopentylpropanoate cid_2085057
Type:
Small organic molecule
Emp. Form.:
C15H19ClN2O3
Mol. Mass.:
310.776
SMILES:
Clc1ccc(NC(=O)COC(=O)CCC2CCCC2)nc1
:
Substrate
Name:
Not Available
Synonyms:
Type:
Mol. Mass.:
358.43
Organism:
Description:
Residue:
3
NA