Target
5-hydroxytryptamine receptor 1A
Ligand
BDBM31019
Substrate
Not Available
Meas. Tech.
Dose Response Assay for Agonists of 5-Hydroxytryptamine (Serotonin) Receptor Subtype 1A (5HT1A)
pH
7.4±n/a
Temperature
296.15±n/a K
EC50
50000±n/a nM
Citation
 PubChem, PC Dose Response assay for agonists of 5-Hydroxytryptamine (Serotonin) Receptor Subtype 1A (5HT1A) PubChem Bioassay (2007)[AID] 
Target
Name:
5-hydroxytryptamine receptor 1A
Synonyms:
5-HT-1A 5-hydroxytryptamine receptor 1A (5-HT-1A) ADRB2RL1 Dopamine D2 receptor and serotonin 1a receptor HTR1A | Serotonin receptor 1A
Type:
Mol. Mass.:
46122.49
Organism:
Homo sapiens (Human)
Description:
Residue:
422
  
Inhibitor
Name:
BDBM31019
Synonyms:
MLS000093991 N-[2-[4-(2,3-dimethylphenyl)piperazin-1-yl]ethyl]-2-(1-ethyl-4-oxidanylidene-furo[3,4]pyrrolo[3,5-c][1,2,4]triazin-3-yl)propanamide N-[2-[4-(2,3-dimethylphenyl)piperazino]ethyl]-2-(1-ethyl-4-keto-furo[3,4]pyrrolo[3,5-c][1,2,4]triazin-3-yl)propionamide SMR000029605 | cid_3235665
Type:
Small organic molecule
Emp. Form.:
C27H34N6O3
Mol. Mass.:
490.5973
SMILES:
CCc1nn(C(C)C(=O)NCCN2CCN(CC2)c2cccc(C)c2C)c(=O)c2cc3occc3n12
:
Substrate
Name:
Not Available
Synonyms:
Type:
Mol. Mass.:
358.43
Organism:
Description:
Residue:
3
NA