Target
5-hydroxytryptamine receptor 1A
Ligand
BDBM31025
Substrate
Not Available
Meas. Tech.
Dose Response Assay for Agonists of 5-Hydroxytryptamine (Serotonin) Receptor Subtype 1A (5HT1A)
pH
7.4±n/a
Temperature
296.15±n/a K
EC50
50000±n/a nM
Citation
 PubChem, PC Dose Response assay for agonists of 5-Hydroxytryptamine (Serotonin) Receptor Subtype 1A (5HT1A) PubChem Bioassay (2007)[AID] 
Target
Name:
5-hydroxytryptamine receptor 1A
Synonyms:
5-HT-1A 5-hydroxytryptamine receptor 1A (5-HT-1A) ADRB2RL1 Dopamine D2 receptor and serotonin 1a receptor HTR1A | Serotonin receptor 1A
Type:
Mol. Mass.:
46122.49
Organism:
Homo sapiens (Human)
Description:
Residue:
422
  
Inhibitor
Name:
BDBM31025
Synonyms:
MLS000086722 N-[3-[butyl(methyl)amino]propyl]-2-(2-oxidanylidene-1,3-benzothiazol-3-yl)ethanamide N-{3-[butyl(methyl)amino]propyl}-2-(2-oxo-1,3-benzothiazol-3(2H)-yl)acetamide cid_3239520
Type:
Small organic molecule
Emp. Form.:
C17H25N3O2S
Mol. Mass.:
335.464
SMILES:
CCCCN(C)CCCNC(=O)Cn1c2ccccc2sc1=O
:
Substrate
Name:
Not Available
Synonyms:
Type:
Mol. Mass.:
358.43
Organism:
Description:
Residue:
3
NA