Target
5-hydroxytryptamine receptor 1A
Ligand
BDBM31028
Substrate
Not Available
Meas. Tech.
Dose Response Assay for Agonists of 5-Hydroxytryptamine (Serotonin) Receptor Subtype 1A (5HT1A)
pH
7.4±n/a
Temperature
296.15±n/a K
EC50
50000±n/a nM
Citation
 PubChem, PC Dose Response assay for agonists of 5-Hydroxytryptamine (Serotonin) Receptor Subtype 1A (5HT1A) PubChem Bioassay (2007)[AID] 
Target
Name:
5-hydroxytryptamine receptor 1A
Synonyms:
5-HT-1A 5-hydroxytryptamine receptor 1A (5-HT-1A) ADRB2RL1 Dopamine D2 receptor and serotonin 1a receptor HTR1A | Serotonin receptor 1A
Type:
Mol. Mass.:
46122.49
Organism:
Homo sapiens (Human)
Description:
Residue:
422
  
Inhibitor
Name:
BDBM31028
Synonyms:
3-[2-(4-carbethoxypiperidino)-2-keto-ethyl]-1-methyl-indole-2-carboxylic acid 3-[2-(4-ethoxycarbonylpiperidin-1-yl)-2-oxidanylidene-ethyl]-1-methyl-indole-2-carboxylic acid 3-{2-[4-(ethoxycarbonyl)piperidin-1-yl]-2-oxoethyl}-1-methyl-1H-indole-2-carboxylic acid SMR000021788 | cid_3241730
Type:
Small organic molecule
Emp. Form.:
C20H24N2O5
Mol. Mass.:
372.415
SMILES:
CCOC(=O)C1CCN(CC1)C(=O)Cc1c(C(O)=O)n(C)c2ccccc12
:
Substrate
Name:
Not Available
Synonyms:
Type:
Mol. Mass.:
358.43
Organism:
Description:
Residue:
3
NA